BDBM50261254 CHEMBL4074130
SMILES Clc1cccc(Cl)c1-c1nc2ccnc(Nc3ccncn3)c2[nH]1
InChI Key InChIKey=CDCDYSODNYLAPT-UHFFFAOYSA-N
Data  2 KI
  Tab Delimited (TSV)   2D SDfile   Computed 3D by Vconf -m prep SDfile
Find this compound or compounds like it in BindingDB:
Activity Spreadsheet -- Enzyme Inhibition Constant Data from BindingDB
Found 1 hit for monomerid = 50261254
TargetNon-receptor tyrosine-protein kinase TYK2(Homo sapiens (Human))
Genentech
Curated by ChEMBL
LigandPNGBDBM50261254(CHEMBL4074130)
Affinity DataKi:  0.600nM. Assay description: Inhibition of TYK2 (unknown origin) by biochemical assay
In DepthDetails ArticlePubMed